Home > Unable To > Unable To Open Executable /library/developer/xcode/deriveddata/

Unable To Open Executable /library/developer/xcode/deriveddata/

Contents

Once I deleted that from my frameworks folder, and added the correct libz library in the build phases section of the target settings, it built as normal. Hide Permalink kosso added a comment - 30/Nov/14 8:36 AM I'm also seeing this with 3.4.1.GA It appears to be related to some modules that need updating too. share|improve this answer answered Feb 26 '15 at 20:05 puzzl 384413 add a comment| up vote 0 down vote Another thing to check -- if you have "Continue build after errors" Was messing around with library paths and it messed up libGoogleAnalytics.a. Source

prblm will be solved. share|improve this answer answered Apr 11 '13 at 21:04 sarabdeep singh 2171311 add a comment| up vote 0 down vote I solved this by deleting the path specified in both Header Browse other questions tagged xcode build or ask your own question. These files also had main() function which was causing it show "duplicate symbol" message. hop over to this website

Error Unable To Open Executable Xcode

I have always seen lots of references to Java and frameworks in the DU log while doing this. kw1330Code is ArtPosts: 28Reg: Nov 14, 2011london78002/10/13 12:33 PM (3 years ago)I haven't had any replies, since the 2nd. So frustrating cos it works on simulator and on my devices, but just can't create archive!

Look for clues in the error message as to which files might be duplicates. Developing web applications for long lifespan (20+ years) What does a well diversified self-managed investment portfolio look like? read the green area. Unable To Open Executable Jar File How many targets do you have (go into the bar next to run and stop at the top and choose "Manage Schemes") and what are they called? –jrtc27 Dec 2 '11

Show Chris Barber added a comment - 15/Sep/14 3:57 PM We just saw this same error on Olga Romero 's machine and her project does NOT have a resource with the Debug Executable Xcode Helpful (0) Reply options Link to this post by xnav, xnav Apr 1, 2011 3:29 PM in response to Phillip Anthony Level 5 (6,640 points) Apr 1, 2011 3:29 PM in It builds and runs fine on simulator and device, it's only when I go to create Archive that the failure happens. All postings and use of the content on this site are subject to the Apple Support Communities Terms of Use.

But recently, while designing my plugin, I've had those errors, and eventually I traced them to various things that I did. xcode swift dsymutil share|improve this question asked Apr 20 '15 at 5:08 woakley5 19010 use this answer stackoverflow.com/questions/8746194/… –Rizwan Shaikh Apr 20 '15 at 6:12 add a comment| 1 Do you have the right provisioning certificates? Still not sure what the magic bullet is.

Debug Executable Xcode

Further, getting Info on the app icon reveals that it is only 8K in size, which makes no sense.I have also noticed that the executable file (in the app folder structure) Terms Privacy Security Status Help You can't perform that action at this time. Error Unable To Open Executable Xcode I'm not ready to really point ALL of the blame on Xcode 4, because Apple doc's state clearly that user's can switch back and forth between versions without problems. Error Unable To Open Executable '' Is A Directory Join them; it only takes a minute: Sign up Xcode - error: unable to open executable…how to fix?

Once I removed -M, a different set of errors led me to include a library I had been missing. http://smartphpstatistics.com/unable-to/unable-to-open-website-in-chrome.html Lord knows what error they issue when the linker can't actually open the file. asked 4 years ago viewed 8647 times active 1 year ago Visit Chat Linked 209 Undefined symbols for architecture i386: _OBJC_CLASS_$_SKPSMTPMessage", referenced from: error Related 58How to decrease build times / I need to get this on the App store urgently and another App as well, based on the same project. Dsymutil Error Unable To Open Executable

Nowadays the error is a bit different: [TRACE] error: unable to open executable '' [ERROR] ** BUILD FAILED ** [ERROR] The following build commands failed: [ERROR] GenerateDSYMFile build/Debug-iphonesimulator/Images.app.dSYM build/Debug-iphonesimulator/Images.app/Images [ERROR] (1 Looking for a book that discusses differential topology/geometry from a heavy algebra/ category theory point of view Unusual keyboard in a picture Infinite sum of logs puzzle more hot questions question more hot questions question feed default about us tour help blog chat data legal privacy policy work here advertising info mobile contact us feedback Technology Life / Arts Culture / Recreation have a peek here If I remove that from tiapp.xml, it compiles as expected, but I think it is related to the Google Analytics module I am using? [TRACE] ld: in /Developer/code/cua-deposify/app/deposify/modules/iphone/analytics.google/1.0/libanalytics.google.a(GAITransaction.o), too many compact

Do the showrunners consider Supergirl to be part of the Arrowverse? Phillip Anthony Level 1 (65 points) Q: Need help with 'unable to open executable ... ' error After I compile I get this error. Helpful (0) Reply options Link to this post by Phillip Anthony, Phillip Anthony Apr 1, 2011 9:20 AM in response to K T Level 1 (65 points) Apr 1, 2011 9:20

I'm using a Mac and the iPhone Simulator. –Filipe Mota Jan 5 '12 at 17:21 1 Trying running Clean using command-shift-K, then uninstall the app from simulator (if exists), then

more hot questions question feed default about us tour help blog chat data legal privacy policy work here advertising info mobile contact us feedback Technology Life / Arts Culture / Recreation Most linkers issue a "duplicate symbol" error and tell you the name of the symbol and the file(s) it's have a problem with, but that isn't very Apple-like. maintaining brightness while shooting bright landscapes Infinite sum of logs puzzle Can two integer polynomials touch in an irrational point? and then click the error.

Still wondering why Xcode doesn't have a check for this kind of stuff. Not the answer you're looking for? Get Started | Login Home Pricing Self Hosting Plugins Forums How To's Buzz Map About Discussion Forums > Xcode, Errors, Installing, Configuring Replies: 16 Views: 394 kw1330Code is ArtPosts: 28Reg: http://smartphpstatistics.com/unable-to/imagemagick-unable-to-open-image.html Meaning of S.

So nothing works now.I cannot write what I'm thinking but ALL OF THIS IS GETTING VERY OLD!