Home > Error While > Brackets Error Launching Browser

Brackets Error Launching Browser


more stack exchange communities company blog Stack Exchange Inbox Reputation and Badges sign up log in tour help Tour Start here for a quick overview of the site Help Center Detailed weblogic 8+JNDI All times are in JavaRanch time: GMT-6 in summer, GMT-7 in winter Contact Us | advertise | mobile view | Powered by JForum | Copyright © 1998-2016 Paul Wheaton In it, you'll get: The week's top questions and answers Important community announcements Questions that need answers see an example newsletter By subscribing, you agree to the privacy policy and terms Make sure to clean the environment during test warmup, add some retry/wait/timeout wrappers around the section that launches the browser, and kill any processes and services that aren't relevant to the this contact form

Reload to refresh your session. I have also tried firefox with no-addon mode, however no difference. We were afraid something like this might happen because of that. JavaException: java.lang.RuntimeException: Could not start Selenium session:error loading script [object HTMLScriptElement] JavaException: java.lang.RuntimeException: Could not start Selenium session:And I've tried with Firefox, including specifying the path to it, and also with

Error While Launching Browser

A SeleniumException is thrown with the message "Failed to start new browser session: Error while launching browser". DefaultSelenium browser = new DefaultSelenium("localhost", 4444, "*firefox", "http://localhost"); 2. How to plot the CCDF in pgfplots? How to tell why macOS thinks that a certificate is revoked?

Survey tool to ask questions on individual pages - what are they called? need confirmation... Deutsche Bahn - Quer-durchs-Land-Ticket and ICE What are "desires of the flesh"? Unexpected Error While Launching Program Why does the material for space elevators have to be really strong?

Related 13Selenium: reuse existing browser session, instead of opening new windows?4Selenium tests aren´t launched anymore2Conditional statement for fail and error test outcomes in Selenium?2Selenium 2 opens Google Chrome but doesn't load Browser Launch Error 1 Is it possible to have a planet unsuitable for agriculture? Send Update CancelFeedbackEmail IDSubject : Comments : Send CancelPrivate MessageType the characters you see in the picture below. Source What is a type system?

Determine if the port is in use using the 'netstat' command: On Windows: netstat -an | find "4444" Expect to see output like this: TCP LISTENING TCP [::]:4444 [::]:0 Error While Launching Command: Gdb --version Last edited by divya_agsrdk on Tue Jan 29, 2013 11:15 am; edited 1 time in totaldivya_agsrdkProfessionalPosts : 93Join date : 2013-01-17 Re: Could not start Selenium session: Failed to start ill check out.. share|improve this answer answered Dec 22 '13 at 7:30 stechray 212 add a comment| up vote 1 down vote Here is an answer here which might help: https://groups.google.com/forum/?fromgroups=#!topic/selenium-users/nFhusJoAzV8 I know that

Browser Launch Error 1

asked 3 years ago viewed 4905 times active 2 years ago Get the weekly newsletter! additional hints And what about "double-click"? Error While Launching Browser How should I interpret "English is poor" review when I used a language check service before submission? Error While Launching Eclipse Using Red Hat Enterprise Linux Server release 5.6 (Tikanga) 64bit on Virtual Box 4.1.8.

Near Earth vs Newtonian gravitational potential Appease Your Google Overlords: Draw the "G" Logo Can There Only be One Context User per Transaction? http://smartphpstatistics.com/error-while/error-while-powering-on-internal-error-vmware-player.html import com.thoughtworks.selenium.*; import java.util.regex.Pattern; import junit.framework.*; public class orkut extends SeleneseTestCase { public void setUp() throws Exception { setUp("https://www.google.com/", "*chrome"); } public void testOrkut() throws Exception { selenium.setTimeout("10000"); selenium.open("/accounts/ServiceLogin?service=orkut&hl=en-US&rm=false&continue=http%3A%2F%2Fwww.orkut.com%2FRedirLogin%3Fmsg%3D0&cd=IN&skipvpage=true&sendvemail=false"); selenium.type("Email", "username"); share|improve this answer answered Sep 18 '09 at 13:30 Mugen 3653824 I ran into the exact same issue, and adding start() fixed the session problem. –ngeek Jun 29 '10 Is intelligence the "natural" product of evolution? Error While Launching Command

Can There Only be One Context User per Transaction? The expected fix is to protect the reference to frameAddress.getLocalFrameAddress() in line 643 (656 as of r15262) by first checking if frameAddress is null, and returning false if so (thus causing mean? http://smartphpstatistics.com/error-while/ole-db-error-ole-db-or-odbc-error-login-timeout-expired-hyt00.html Determine if a coin system is Canonical Are independent variables really independent?

Not the answer you're looking for? Could Not Start Selenium Session: Failed To Start New Browser Session Near Earth vs Newtonian gravitational potential Why would a password requirement prohibit a number in the last character? Windows 2003 Server on VMWare Selenium RC 2.15.0 and Firefox 3.6.24 What makes it so worse, is the fact that it takes up to 30minutes until the exception is thrown.

Why would a password requirement prohibit a number in the last character?

I have also tried removing existing firefox profiles and recreating them. 5. I am now using googlechrome instead. Linked 1 Runtime exception at selenium.start() - Could not start Selenium session: Failed to start new browser session: Error while launching browser 0 Taking snapshots of different webpages using selenium in Error While Launching Browser On Session Null The exception stacktrace is as shown below. 12:06:54.218 INFO - creating new remote session 12:06:54.218 INFO - Allocated session 6461092698d344f0b9856f9152024b63 for http://www.fromdev.com, launching... 12:06:54.234 INFO - Preparing Firefox profile... 12:07:15.238 ERROR

i mean selenium-server.jar y standalone is neededdivya_agsrdkProfessionalPosts : 93Join date : 2013-01-17 Re: Could not start Selenium session: Failed to start new browser session: Error while launching browser byadityac on once in the command prompt if i give to run , it willl show some info . What is the most expensive item I could buy with £50? http://smartphpstatistics.com/error-while/error-during-ping-operation-error-while-silently-connecting.html So I've parked on FF 12.0 now (turned off auto updates - actually had to update some files - here is a link if others are interested (http://support.mozilla.org/en-US/questions/839764 ) and I'll

sorry for inconvinient... in d prompt. selenium2 robotframework share|improve this question edited Dec 22 '13 at 10:27 testerab♦ 3,52612145 asked Jan 24 '13 at 13:44 Onivas 6614 add a comment| 2 Answers 2 active oldest votes up I have tried following things 1.

browser.Start(); Do that often enough with just the right timing and it may happen. What is the expected output? UPDATE heap table -> Deadlocks on RID more hot questions question feed about us tour help blog chat data legal privacy policy work here advertising info mobile contact us feedback Technology We recommend upgrading to the latest Safari, Google Chrome, or Firefox.

Why is the spacesuit design so strange in Sunshine? How to convert a set of sequential integers into a set of unique random numbers? Infinite sum of logs puzzle Did Sputnik 1 have attitude control? That slows down my test suite intolerable and i vote for a higher priority of this issue Reported by u.froehling on 2012-01-25 11:54:52 Selenium member lukeis commented Mar 3, 2016 Same

posted 4 years ago Tried it, doesn't work either. Browse other questions tagged selenium2 robotframework or ask your own question. Sign in. Could you post some code, that show how you are trying to launch the browser (or the config you are using) ?

How do you say "root beer"?