Home > Error While > Apt Cache Search Libz So

Apt Cache Search Libz So

Contents

Makefile output /sbin/mkfs.jffs2: error while loading shared libraries: libz.so.1:cannot open shared object file : No such file or directory make[1] :***[install] Error 127 make[1] : Leaving directory make:*** [system] Error 2 Which day of the week is today? I: Building resources... asked 2 years ago viewed 54931 times active 2 months ago Visit Chat Linked 43 How to fix Android Studio getting stuck executing Gradle tasks? 3 Android Studio 64-bit ERROR: 32-bit this contact form

share|improve this answer answered May 13 at 4:55 Bogdan 1 add a comment| Your Answer draft saved draft discarded Sign up or log in Sign up using Google Sign up I can't do yum, rpm or neither can start any services It throws out following error, everything time I try to do anything related installation. Good Term For "Mild" Error (Software) How would they learn astronomy, those who don't see the stars? asked 1 year ago viewed 711 times active 10 months ago Related 0Trying to compile powertop for arm using cross compile in Ubuntu with malloc issue0Cross compiling, library gmp not found1cross

Error While Loading Shared Libraries Libz So 1

Browse other questions tagged linux redhat or ask your own question. Why did it take 10,000 years to discover the Bajoran wormhole? "all empires will suffer the same fate should the lessons from history go unlearnt" The mortgage company is trying to Is there any alternative to the "sed -i" command in Solaris?

But probably there are docs out there that tell exactly which those are. Solved on Debian 8 Jessie AMD64 –Joaozito Polo Jan 6 at 2:07 For CentOS I needed to install both zlib and libgcc. Error stated the following when trying to execute compose file : docker-compose up -d docker-compose: error while loading shared libraries: libz.so.1: failed to map segment from shared object: Operation not permitted Libz.so.1 Centos How to plot the CCDF in pgfplots?

Ask Ubuntu works best with JavaScript enabled Log In How can I install a shared library (libz.so) in my workspace? Error While Loading Shared Libraries Libz.so.1 Centos Navigation Home Tools My GitHub My DockerHub Images Cheatsheets Home Tools My GitHub My DockerHub Images Cheatsheets Docker compose: error while loading shared libraries libz.so.1 Docker compose: error while loading shared Submit feedback to IBM Support 1-800-IBM-7378 (USA) Directory of worldwide contacts Contact Privacy Terms of use Accessibility current community blog chat Server Fault Meta Server Fault your communities Sign up or https://community.c9.io/t/how-can-i-install-a-shared-library-libz-so-in-my-workspace/1129 My account doesn't have permissions to install the package so can someone from Cloud9 do it for me?

How? Libz.so.1 Redhat bradydowling 2016-01-09 16:34:30 UTC #2 Per the official Ionic installation guide, you should install some dependencies to your workspace before you can use the Android SDK. Exception in thread "main" /tmp/brut_util_Jar_4725780192128114282.tmp: error while loading shared libraries: libz.so.1: cannot open shared object file: No such file or directory brut.androlib.AndrolibException: brut.androlib.AndrolibException: brut.common.BrutException: could not exec command: [/tmp/brut_util_Jar_4725780192128114282.tmp, p, --forced-package-id, Seems to be isolated to 32bit support on 64bit system (i think).

Error While Loading Shared Libraries Libz.so.1 Centos

Top Display posts from previous: All posts1 day7 days2 weeks1 month3 months6 months1 year Sort by AuthorPost timeSubject AscendingDescending Post Reply Print view 3 posts • Page 1 of 1 Return http://www.centos.org/forums/viewtopic.php?t=2410 Are "ŝati" and "plaĉi al" interchangeable? Error While Loading Shared Libraries Libz So 1 Need help ASAP. Error While Loading Shared Libraries Libz.so.1 Redhat more stack exchange communities company blog Stack Exchange Inbox Reputation and Badges sign up log in tour help Tour Start here for a quick overview of the site Help Center Detailed

What does a well diversified self-managed investment portfolio look like? weblink Why is it a bad idea for management to have constant access to every employee's inbox Can a Legendary monster ignore a diviner's Portent and choose to pass the save anyway? How to handle a senior developer diva who seems unaware that his skills are obsolete? You might try "yum reinstall zlib-devel" jpollard View Public Profile Find all posts by jpollard #6 6th December 2011, 02:54 AM gb127 Offline Registered User Join Date: Dec Libz.so.1 Not Found

I: Checking whether resources has changed... see if the library exist on your system: locate libz.so.1 - or - find / -name libz.so.1 2. Unusual keyboard in a picture The mortgage company is trying to force us to make repairs after an insurance claim Physically locating the server "all empires will suffer the same fate navigate here So after a bit of wondering around on internet I came across this github issue and I tried one of the workarounds which worked in my instance.

yum install zlib.i686 libgcc –RightHandedMonkey Apr 27 at 19:39 add a comment| up vote 2 down vote Check below link: Specially "Install 32 bit libraries (if you're on 64 bit)" https://github.com/meteor/meteor/wiki/Mobile-Dev-Install:-Android-on-Linux Error While Loading Shared Libraries: Libz.so.1 Linux android ubuntu ubuntu-12.04 android-sdk-tools share|improve this question edited Jan 21 '14 at 11:51 Andreas 3,65632146 asked Jan 21 '14 at 11:29 user3218948 256136 add a comment| 6 Answers 6 active oldest We recommend upgrading to the latest Safari, Google Chrome, or Firefox.

Error: bash: ./test1: No such file or directory0Linking IDE with right compiler for ARM cross compiling Hot Network Questions Extended support for Ubuntu 12 Does “hack” have meanings other than “rough

As you can't use the package system you are going to have to try to do it manually and even then it may be too difficult to solve. I can compile the open cv app fine on Ubuntu with g++ test.c -o test -I /usr/include/opencv -I /usr/include/opencv2 -L /usr/local/lib/ -lopencv_core -lopencv_imgproc -lopencv_highgui It compiles and I have a testl.bin Here is the command you should run:
sudo apt-get install lib32z1 lib32ncurses5 lib32bz2-1.0
You should not be asked for a password for sudo. Libz.so.1 Not Found Ubuntu gb127 View Public Profile Find all posts by gb127 #2 5th December 2011, 01:24 PM marriedto51 Offline Registered User Join Date: Jul 2009 Location: England, UK Posts: 966

Search Categories Ansible Azure C# Chef Docker DSC Electronics Firewall Fusion 360 general HAproxy PowerShell Tools Uncategorized Unix Virtualization Archives September 2016 August 2016 July 2016 June 2016 May 2016 April Top pschaff Retired Moderator Posts: 18276 Joined: 2006/12/13 20:15:34 Location: Tidewater, Virginia, North America Contact: Contact pschaff Website libz.so.1 file Quote Postby pschaff » 2012/06/15 17:20:11 Code: Select allyum install zlib.i686Just Solution was to remount tmp with exec permission by executing : Shell sudo mount /tmp -o remount,exec 1 sudo mount /tmp -o remount,exec Share this:TweetEmailPrintMoreShare on TumblrPocket Related Leave a http://smartphpstatistics.com/error-while/error-while-loading-shared-libraries-libz-so-1-centos.html Reload to refresh your session.

Somewhat Generalized Mean Value Theorem more hot questions question feed about us tour help blog chat data legal privacy policy work here advertising info mobile contact us feedback Technology Life / Try Code: su -c 'yum install zlib.i686' marriedto51 View Public Profile Find all posts by marriedto51 #8 6th October 2013, 06:27 PM srinivasanth Offline Registered User Join Date: linux redhat share|improve this question asked Nov 9 '15 at 7:18 Pravin 62 1 show the output of ls -l /lib64/libz*. –Hangin on in quiet desperation Nov 9 '15 at Must I make LD_LIBARY_FILE point to it?Any help appreciated.

New tech, old clothes more hot questions question feed default about us tour help blog chat data legal privacy policy work here advertising info mobile contact us feedback Technology Life / Perhaps the library is not installed on your system and you need to install it. The way I found to take care of this in Ubuntu issudo apt-get updatesudo apt-get install ia32-libs apt-get is not in centOS so I used sudo yum update (and it worked In the United States is racial, ethnic, or national preference an acceptable hiring practice for departments or companies in some situations?

Email check failed, please try again Sorry, your blog cannot share posts by email. Somewhat Generalized Mean Value Theorem What is the best way to upgrade gear in Diablo 3? What are Imperial officers wearing here? Answer 1.

Google™ Search FedoraForum Search Red Hat Bugzilla Search
Search Forums Show Threads Show Posts Tag Search Advanced Search Go to Page... I just did find `pwd` -type d | xargs | tr " " ":" to generate a complete listing of all subdirectories. Have any other solution?Thanks for helping. Digital Diversity Can There Only be One Context User per Transaction?

Just make sure to add proper dirs to the path. Sign in to comment Contact GitHub API Training Shop Blog About © 2016 GitHub, Inc.