Home > Error While

rufus undetermined error while formatting fix

vmplayer internal error while powering on

export_too_much_data cx_sy_compression_error

error while archiving folder inbox in store some items cannot be copied

error while archiving folder inbox in store outlook 2010

remote access configuration utility

error while archiving folder inbox in store outlook 2007

error while archiving folder in store

error while archiving folder inbox in store they were either moved or deleted

error while archiving inbox in store

error while archiving folder office 2010

error while archiving folder junk e-mail in store

error while archiving folder calendar in store google apps

error while archiving folder inbox in store personal folders outlook 2007

error while archiving folder inbox in store mailbox username

initializestaticfilehandler srve0278e: error while adding servlet mapping --> /*.

error while archiving folder outlook 2010

error while archiving folder sent items in store

error while archiving folder deleted items in store

error while archiving folder access denied

error while building/deploying project (kit desktop)

error while archiving folder in store a folder by this name already exists

error while archiving folder in store the destination folder contains items of a different type

briss pdf crop

outlook error while archiving folder some items cannot be copied

error while archiving folder inbox in store a folder by this name already exists

error while closing command context

error while decoding stream ffmpeg

yast error while creating client module sw_single

ffmpeg error while decoding stream invalid data found when processing input

error while archiving folder inbox in store mailbox

snc sapcryptolib pse

error while checking in and storing

error while archiving pst cannot be opened

autoyast error while configuring partitions

error while archiving store outlook 2007

ubuntu error copying file invalid argument

error while archiving folder top of information store in store mailbox

error while crawling lob contents sharepoint 2013

parity check 2 error while booting

disk error while booting

h264 error while decoding mb bytestream

ffmpeg error while decoding mb

error while loading pse trust025

error while executing gem ... (argumenterror) ipv6 address must be 16 bytes

matlab uicontrol callback error

error while evaluating uicontrol callback

convertxtodvd error while encoding file

matlab error while evaluating uimenu callback

error while downloading apps

error while downloading from server clockworkmod touch

cannot delete key error while deleting key

error while evaluating uicontrol callback attempt to reference field of non-structure array

error while dumping state probably corrupted stack

error while executing gem ... (nomethoderror)

error while checking in and storing message no. 26253

error while configuring partitions try again

roxio 8004520c error while encoding movie 1

feval(varargin{:});

error while archiving folder outlook 2007

gem install local

error while archiving folder sent items in store outlook 2010

error while archiving store personal folders outlook 2007

error while downloading from server clockworkmod

cwm restore error while flashing boot image

error while getting interface flags no such device ubuntu

error while deleting key regedit windows 8

regedit error while deleting key

ffmpeg error while decoding stream

wlan0 error while getting interface flags no such device

error while evaluating timerfcn for timer 'timer-5'

timeout error while checking server version

error while archiving folder inbox in store personal folders

error while deleting linux

roxio mydvd error while encoding movie 1

error while loading code module 'microsoft.crm.reporting. rdlhelper

registry editor error while deleting key

error while extracting database product name - falling back to empty error codes

error while downloading app from play store

error while expanding policy

ubuntu evolution error while fetching mail

ramdisk boot initialization failed

error while deleting key windows 7

what is sd-ext

initializing boot agent

error while executing gem

error while executing gem errno ehostdown

io error while decoding

error while initializing managers

error while linking dev pascal

error while deleting key regedit windows 7

error while executing gem ... (socketerror) getaddrinfo name or service not known

runique client download

error while archiving folder inbox in store

error while linking lazarus

decode ioncube license file

error while adding servlet mapping for path

error while initializing the nic acer aspire one

isdone.dll error while installing

libglu.so.1: cannot open shared object file: no such file or directory

error 25007 initializing fusion loadlibraryshim

error com sap asj cft 000205 error occurred while scanning db

error while archiving store mailbox

play framework io error while decoding

data package processing terminated

error while loading code module ssrs 2008

error while archiving folder outlook 2010 some items cannot be copied

mysql workbench error while loading image

error while evaluating conditional

error while initializing manager java lang nullpointerexception bail out

mbot error while initializing network interface

word file encoding error

ffmpeg decoding for stream 0 failed

error while loading shared libraries libz so 1 cannot open shared object file

libexpat.so.0 not found

lazarus error while linking

error while fetching permissions for

error while extracting database product name

how to decompile apk using apktool

error while archiving folder inbox unknown error

error while copying content to a stream httpclient

sqlplus error while loading shared libraries libclntsh.so.11.1 cannot open shared object file

error while archiving folder pitts ipm root

error while loading shared libraries libclntsh so 11.1 cannot open shared object file

error while loading shared libraries libstdc++.so.6 ubuntu

srve0274w error while adding servlet mapping

error while loading shared libraries libgl so 1 skype

unicows.dll download

error while flashing boot image android

error while deleting key vista

libgtk-x11-2.0.so.0 centos

dl wow patch

dhcp error while importing option 6

fatal error during installation windows xp sp3

error while importing package

libgtk-x11-2.0.so.0 ubuntu

ifort error while loading shared libraries

registry cannot delete error while deleting key

tpm error code 0x80072030

libdb.so.2 rpm

undetermined error while formatting

error while loading shared libraries libaprutil 1

commonqt

cannot delete error while deleting key registry

error while loading shared libraries libgl.so.1 centos

deleted libc.so.6 by mistake

error while installing windows xp

error while loading shared libraries ubuntu

dvdfab failed to burn dvd

diskpart clean error access denied

error while loading shared libraries cannot open shared object file no such file or directory

error while flashing boot image on clockwork

error while connecting to ldap javax.net.ssl.sslexception certificate not verified

libaprutil-1.so.0 rpm

export smigserversetting dhcp error 32

ssrs the system cannot find the file specified

filename too long error while copying

error using struct2handleerror while evaluating uicontrol createfcn

ubuntu error while copying destination is read only

samsung error while backing up boot image

error while executing gem errno eacces permission denied

gem commandlineerror

windows 8.1 hive location

error while initializing the batik svg extensions java.lang.noclassdeffounderror org/apache/batik/util/xmlresourcedescriptor

raw h264 file download

error while building/deploying project

cannot delete office error deleting key

cannot load ntuser.dat.log error while loading hive

jacoco class is already instrumented

install libevent

error while deleting directory not empty

windows failed to open the ramdisk image

error while loading shared libraries ld_library_path

error initializing output device

error while loading shared libraries libstdc++ so 6 wrong elf class elfclass32

openssl error while loading serial number

error while loading shared libraries libz.so.1 centos

error while loading shared libraries cygwin

error while loading shared libraries: libcurl.so.4 ubuntu

reference to undefined global `str'

error executing task createembeddedresources

interceptor commandcontext error while closing command context

error while initializing the sound driver fedora

tophat error while flushing and closing output

error while loading shared libraries libssl so

brackets error launching browser

libjli.so: open failed: no such file or directory

error while loading shared libraries libc.so.6 cannot open shared object file

kong yml

error encountered while ber decoding digital signature

error while opening encoder for output stream

libpq.so.5 not found

encountered an error while parsing an appropriate resource file could not be found

freemind download

error while loading shared libraries libgsl.so.0 cannot open shared object file

error while dumping state

error while loading shared libraries libcrypto so 4

error while archiving folder ipm_subtree

libncurses.so.5 arch linux

error while making a backup image of /data

libjli.so not found ubuntu

libxm.so.3: cannot open shared object file: no such file or directory

error while crawling lob contents sharepoint 2010

audacity error while opening sound device mac

youtube tap to retry android

error while attempting to connect to view composer

vmware error while loading shared libraries libx11 so 6

lazarus ide download

libx11.so.6: cannot open shared object file: no such file or directory

error while opening encoder for output stream maybe incorrect parameters

cwm error while making a backup image of /data

error while parsing arguments maya 2016

gentoo error while loading shared libraries libexpat so 0

error while archiving folder ipm_subtree in store

error while flashing boot image

encountered an error while parsing

microsoft office 2007 error during installation

error while preparing to send sharing message outlook 2007

cannot open shared object file no such file or directory linux

error tuxconfig environment variable not set

lyx instant preview

error while opening the virtual machine taking ownership of this virtual machine failed

error while executing the query

deleting sa reason "death by retransmission p1" state (i) mm_no_state

docker error while loading shared libraries

error while loading shared library

grub4dos error while parsing number

parsing xls file in java

error while opening sound device

error while loading shared libraries: libdb.so.3: cannot open shared object file:

lib error while loading shared libraries

apt cache search libz so

libpq.so.5 ubuntu

error while restoring /system cwm

error while loading shared libraries libstdc++.so.6 centos

vmware player error while powering on internal error

centos libjemalloc

error while powering on vmware player cannot connect to the virtual machine

error while saving settings to database

there was an error while performing this operation

org.apache.hadoop.hive.ql.metadata.hiveexception: hive runtime error while processing row

error while performing action working copy locked rapidsvn

printing from macbook air to network printer

error while searching for networks htc one

error parsing data org.json.jsonexception end of input at character

srve0278e: error while adding servlet mapping

ffmpeg error while opening encoder for output stream

error while searching for networks android fix

error while searching for networks t mobile

crossgcc error while loading shared libraries

error while registering forbidden

error while parsing an xml stream 'bom / charset detection failed'

sqlplus error while loading shared libraries libsqlplus.so linux

error while installing windows 7

system.data.sqlclient.sqlerror while restoring database

jellytime network

jdeveloper error while reading wsdl file

ubuntu local share

there was an error while registering your kindle

error while retrieving data from infrastructure navigator

error while loading shared libraries libxm so 3 ubuntu

audacity error while opening sound device playback

error while loading shared libraries: libx11.so.6 centos

rapidsvn error while refreshing filelist

error while preparing to send sharing message outlook 2010 office 365

grub4dos error 23 error while parsing number

(oracle.jbo.dmlexception) jbo-26061: error while opening jdbc connection. jdeveloper

sqlplus error while loading shared libraries

ows-04115 an error occurred for port fabric provider

error line 762 error while parsing arguments

error while parsing arguments maya

libimf.so location

gimp error while saving

error while loading shared libraries no such file or directory ubuntu

predis error reading line from server

error opening process access is denied

pro tools initializing audio engine

error while loading shared libraries: libqtwebkit.so.4 ubuntu

error while copying in ubuntu

error while preparing to send sharing message outlook 2013 calendar

libmpc.so.3 cannot open shared object file

error while powering on the vmware authorization service is not running. windows 7

error while searching for networks g2

sqlanalysisservices error while processing the cube

eclipse error while loading shared libraries no such file or directory

error while loading shared libraries: libgtk-x11-2.0.so.0 ubuntu

error while retrieving information

error while loading shared libraries no such file or directory

error while loading shared libraries libcudart.so.7.0 wrong elf class elfclass32

error while trying to retrieve text for error ora-12514

checksum error while extracting

error while trying to retrieve text for error ora 01019 vb6

error while opening this process hack

libxm.so.3 ubuntu

error while trying to retrieve text for error ora 01019

dpkg: error processing package initramfs-tools (--configure):

error while printing mac

error while trying to retrieve text for error ora 12154

http 503

visual studio error while trying to run project unable to start debugging

error while making a backup image of /system

error while setting default search

windows 10 safe mode

srvctl error while loading shared libraries libpthread so 0

error while opening sound device audacity windows 7

grabit error while selecting group 480

error while reading configuration for secure communication in sap

audacity error while opening sound device windows 10

error while loading shared libraries libz so 1

error while loading shared libraries libssl so 1.0 0

error while processing sa request failed to initialize sa

error while unpacking program code 2 dragon

error while loading shared libraries libc so 6

sqlplus error while loading shared libraries libaio so 1

libncurses.so.5 arch

error while trying to sync audio and midi logic

crs-4000: command start failed, or completed with errors.

error while loading shared libraries libdl so 2 oracle

error while preparing to send sharing message outlook 2010 calendar

mac error while printing message

unload assembly from appdomain c#

error while updating filelist rapidsvn

outlook error while writing spool file

error while writing spool file thunderbird

error while storing the user information the user might have been deleted

fndwrr.exe error

error while loading shared libraries libcrypto so 10

touchdown error refreshing folders

error while trying to run project unable to start debugging on the web server server side error

error while trying to synchronize audio and midi garage band

system cannotunloadappdomainexception reportviewer

error while powering on vmware player

registry editor could not set owner

asadmin delete-service

ocaml dynamic linking

datastage ora 12154

libpcap.so.0.8: cannot open shared object file: no such file or directory

error while unloading appdomain reportviewer

epmhfm-65536: an unexpected error has occurred

printing ubuntu server

error while starting eclipse

451 error email

error while trying to run project unable to start debugging access is denied

error while unpacking program code 2 please report to author

error while writing wav audacity

preview error while printing

error while uploading final hdr block

sony c1905 error while uploading data block

ora-01019 error while trying to retrieve text

error while writing local file

error message when sharing calendar

error code lp5 please report to author

youtube error loading tap to retry android

dvdfab error while reading

nexus 5 error while searching for networks

biztalk error while removing application mscorlib

error while preparing to send sharing message outlook 2007 exchange 2013

error while preparing to send sharing message outlook calendar

the database reported error while performing requested operation

sftp error while writing failure

error while searching for networks

kindle book download incomplete

error while searching for networks android

error while trying to retrieve text for error ora 12541

error while searching for networks galaxy s3

error while preparing to send sharing message office 2013

ora 01519 dtxnspc bsq

error while trying to retrieve text for error ora 12154 asp net

error while unpacking program code 2 please report to author microsoft money

error while trying to retrieve text for error ora 12545

floreysoft error while parsing

error while powering on internal error vmware player

error while unpacking program code lp5 bossran

error during ping operation error while silently connecting

error while trying to smb database not created

error while retrieving information from server df-dferh-01

ole db error: ole db or odbc error: login timeout expired; hyt00

clockworkmod recovery

cryptostream to memorystream c#

error while preparing to send sharing message outlook 2010

error while setting up environment for the application java

ora 12514 sqlplus

whoamiresponse

error while uploading data block 000008 000073

vs error while trying to run project

error while waiting for server message tightvnc mac

ora 12514 toad

mysql error while loading shared libraries

error while reading data

kb: 2043070

plex error while opening file hulu

sftp server error process_write write failed

error while running worksheets window object doesn't support this property or method

i/o error while writing bcp data-file

error while sending output connection refused connect

system applicationexception error while rendering the chart

vmware player error while powering on the file specified is not a virtual disk

ccleaner

error while setting up environment for the application

cannot unload error while unloading hive

error while waiting for server message tightvnc

svn: e130003: the xml response contains invalid xml

dvdfab blu ray read error

java access is denied error

error while refreshing filelist unknown error

error while reading failure

ssis error while trying to retrieve text for error ora 01019

read process memory c++

error while loading shared libraries libmysqlclient so 18

error parsing xml file into an array

grabit error while selecting group

error while restoring /data clockworkmod

error while receiving a pdu from localhost

error while loading shared libraries libz.so.1 ubuntu

error while preparing to send sharing message outlook 2010 contacts

vmplayer

the document could not be printed

ggsci error while loading shared libraries libnnz11

eth0 error while getting interface flags ubuntu

eth0 error while getting interface flags no such device

 - 1