Home > Error Unknown > Error Unknown Type Name Char16_t

Error Unknown Type Name Char16_t

Contents

I have all dependancies installed via homebrew (poppler, zlib, ...).the PKG_CONFIG path is set correctly, everything is found, but I get the following output upon running make -s: /elpa/pdf-tools-20150204.857/build$ export PKG_CONFIG_PATH=/usr/local/Cellar/zlib/1.2.8/lib/pkgconfig:/usr/local/lib/pkgconfig:/opt/X11/lib/pkgconfig How? Can two integer polynomials touch in an irrational point? I know it's not very helpful, because I cannot code the changes myself. have a peek here

What advantages does Monero offer that are not provided by other cryptocurrencies? How do you say "root beer"? What about the gnu-runtime? This is required to navigate some of the compiler differences at times.So clairify?1. https://github.com/politza/pdf-tools/issues/13

Error Unknown Type Name Pd_file_t

We recommend upgrading to the latest Safari, Google Chrome, or Firefox. All working fine. Going to be away for 4 months, should we turn off the refrigerator or leave it on with water inside? So, in round terms it should work as expected - however: (a) there's nothing to prevent the User from using it in the Wrong Place (i.e.

Owner politza commented Feb 5, 2015 Rainer M Krug writes: I now get the following error: [...] make[1]: *** [epdfinfo-epdfinfo.o] Error 1 make: *** [all] Error 2 This seems to How do I answer why I want to join a smaller company given I have worked at larger ones? Due to security concerns inherent in the design of tempnam(3), it is highly recommended that you use mkstemp(3) instead. [-Wdeprecated-declarations] filename = tempnam(NULL, "epdfinfo"); ^ make[2]: *** [epdfinfo-epdfinfo.o] Error 1 make[1]: Error Unknown Type Name Uint8_t And libio.h is very probably not a compiler-specific header (but a libc specific one) –Basile Starynkevitch Oct 16 '14 at 17:35 3 @raja ashok I would never use a #define

FreeRTOS for CooCoxPosted by nicdear on December 4, 2013Hey Richard, You were right :-) Very concerning that ST released a standard library that contained conflicting file names (I had to modify Baffled with MAX232A Loopback 24v input to microcontroller MPLAB Harmony Configurator failed to initialize PIC32 USB MSD to SD Card - Add to Existing Project Active Posts [Resolved] Harmony printf Comment 17 Iain Sandoe 2014-12-22 21:49:04 UTC (In reply to mrs@gcc.gnu.org from comment #16) > We can fixincludes NS_BLOCKS_AVAILABLE support back in, this would disappear > interfaces that cannot be supported. Do Not Use the V1.42 Compiler with Harmony V1.08, Use V1.40 with the V1.42 Patch file?2.

See the files license.txt (included in the distribution) and this copyright notice for more information. Permission is hereby granted, free of charge, * to any person obtaining a copy of this software and associated documentation * files (the "Software"), to deal in the Software without restriction, IMHO, it s pretty much a lost cause unless resources are committed to attempt to match the feature set of the current objective c in clang/llvm. The mortgage company is trying to force us to make repairs after an insurance claim "all empires will suffer the same fate should the lessons from history go unlearnt" Are there

Error Unknown Type Name Size_t

I don't even know if Apple still attempts to distinguish the objective c changes. http://stackoverflow.com/questions/26410466/gcc-linaro-compiler-throws-error-unknown-type-name-size-t In the past, this was a safe thing to do, and might well be still safe wrt the runtime. Error Unknown Type Name Pd_file_t So it's part #1 of N that will be needed to implement this part of the modernisation. ==== NOTE that on my tests we still fail to parse the system headers Error Unknown Type Name Pthread_rwlock_t Can't debug with MPLAB X, keep getting "An Error occured while running" 8-Bit RGB Display LAN9303 port mirroring configuration using PIC32 All FAQs Basic Commands for OTAA Join Frequency Settings

No mater what i have tried i just cant get any graphics example to compile. navigate here Anyway, enough ranting... Error while processing /Users/ramnathiyer/Documents/Projects/Aviary-iOS-SDK/AviarySDK-4.0.1/AviarySDK/AviarySDK.framework/Versions/A/Headers/AFOpenGLManager.h. /Users/ramnathiyer/Documents/Projects/Aviary-iOS-SDK/AviarySDK-4.0.1/AviarySDK/AviarySDK.framework/Versions/A/Headers/AFPhotoEditorContext.h:39:35: error: cannot find interface declaration for 'NSObject', superclass of 'AFPhotoEditorContext' @interface AFPhotoEditorContext : NSObject ~~~~~~~~~~~~~~~~~~~~~~~~~~~~~~~ ^ /Users/ramnathiyer/Documents/Projects/Aviary-iOS-SDK/AviarySDK-4.0.1/AviarySDK/AviarySDK.framework/Versions/A/Headers/AFPhotoEditorContext.h:45:41: error: unknown type name 'CGSize' @property (nonatomic, assign, readonly) elpa/pdf-tools-20150204.857/build$ make CC=gcc-4.9 -s In file included from /usr/local/Cellar/poppler/0.29.0/include/poppler/error.h:36:0, from epdfinfo.c:20: /usr/local/Cellar/poppler/0.29.0/include/poppler/goo/gtypes.h:34:9: error: unknown type name 'bool' typedef bool GBool; ^ In file included from /usr/local/Cellar/poppler/0.29.0/include/poppler/error.h:37:0, from epdfinfo.c:20: /usr/local/Cellar/poppler/0.29.0/include/poppler/goo/GooString.h:47:1: error: unknown Error Unknown Type Name Uint32_t

Did you try to apply the patch I mentioned ? You signed out in another tab or window. compile output: In file included from hpdf.c:10:0: /usr/local/include/hpdf.h:166:19: error: unknown type name ‘HPDF_Error’ hpdf.c: In function ‘luaopen_hpdf’: hpdf.c:3944:3: warning: implicit declaration of function ‘luaL_setfuncs’ [-Wimplicit-function-declaration] thanks msva commented Jun 14, 2015 http://smartphpstatistics.com/error-unknown/error-unknown-provider-scopeprovider.html the "root path" of homebrew, which is in my (and the default) case /usr/local The $(brew --repository)/lib/pkgconfig is standard, but somehow zlib did not ccreate a link there, so it had

It looks like the #include is pulling in poppler/Error.h which is a C++ file. GCC documentation says that anything included with the -I option will take precedence over a system header file. Any and all data, files, source code, html content and documentation included in the FreeRTOSTM distribution or available on this site are the exclusive property of Real Time Engineers Ltd..

How do I explain that this is a terrible idea?

as i use lua5.1, this problem: hpdf.c: In function ‘luaopen_hpdf’: hpdf.c:3944:3: warning: implicit declaration of function ‘luaL_setfuncs’ [-Wimplicit-function-declaration] will report link error, when try to generate pdf with this hpdf package. It looks like the #include is pulling in poppler/Error.h which is a C++ file. We should be able to steal code from MIT style runtimes to put into newer systems, if we can get FSF approval for incorporating code they don't own. Can any one please how to resolve this error.

Both the Graphics project build and run successfully on HW.Following is the Environment used:- MPLABX v3.26- XC32 1.40 compiler with v1.42b part support installed- Harmony v1.08- MHC v1.0.8.7- Windows 7 OS- How do computers remember where they store things? sharpie-clang-parser exited with error code: 1 System.Exception: sharpie-clang-parser exited with error code: 1 at Sharpie.ObjC.Parser.Parse (System.IO.TextWriter sexpWriter, System.Collections.Generic.List`1 stderrLines) [0x00000] in :0 at Sharpie.Mac.MainWindowController+c__AnonStorey3.<>m__B (System.Object o) [0x00000] in :0 Please can this contact form Near Earth vs Newtonian gravitational potential Security Patch SUPEE-8788 - Possible Problems?

If you have any suggestions, I would not mind trying further, but at the moment I am at a loss. can't MIT-licensed packages be used in GPLed projects? Comment 15 Dominique d'Humieres 2014-12-22 14:17:08 UTC With the patch in comment 14, I get === obj-c++ Summary for unix/-m64 === # of expected passes 3073 # of unexpected failures 13 That is not exactly true, there are some updates, and the numbers do not always match. #6 Jump to: Jump to - - - - - - - - - -

How to solve the old 'gun on a spaceship' problem? We can cross that bridge where we come to it unless V2.00 is Very Soon3. Comment 4 Francois-Xavier Coudert 2014-11-08 13:53:33 UTC (In reply to Dominique d'Humieres from comment #3) > Does it means that 'id' should be replaced with 'instancetype' in failing > tests? the last one is standard as far as I know.

In any case, what I wanted to say is: I don't think we need more analysis of this.